{"text_format":"1","workbook":"xlsx","n_sheets":10,"sheets":["Documentation","Simplified Capital Proj - Old","Simplified Capital Proj - New","Capital Req't Calc - Old","Simplified Capital ProjectionV2","Summary and Discount of CoC V2","Capital Req't Calc - New","Summary","Risk-free rates","Correlation Matrix"],"not_rendered":{"charts":0,"images":1,"macros":0,"external_links":0,"defined_names":53,"comments":0,"pivot_tables":0},"unopened":[],"bounds":{"document_bytes":16777216,"sheet_cells":100000,"rows_first":2000,"rows_last":500,"rows_between":2000,"halvings":0,"cell_chars":16384,"cell_head_chars":4096},"cells_cut":0,"cells_raw":0,"read":"whole","date_system":"1900"}

{"sheet":"Documentation","index":0,"n_rows":41,"n_cols":2,"rows_kept":41,"cut":false,"hidden":false,"merged":[[12,0,12,10],[8,0,8,10],[18,0,18,10],[32,0,32,10],[36,0,36,10],[40,0,40,10],[16,0,16,10],[34,0,34,10]]}
[]
[]
[]
[]
["Documentation"]
[]
["Introduction"]
[]
["This Risk Margin Calculator is intended as a demonstration of an approach that might be usable by long-term insurers to determine risk margins by the cost of capital method.  Companies are welcome to (a) use this tool directly, (b) use their own processes to develop components of the future risk margins and enter them into this model, or (c) determine risk margins by the cost of capital method using their own processes entirely. "]
[]
["Approach Taken"]
[]
["Most long-term insurers determine their capital requirements from the capital factors in the standard BSCR model.  Consequently, forecasting future capital requirements can reasonably be driven by forecasting the base amounts from which the standard capital requirements are obtained.  This Risk Margin Calculator seeks as input the current and projected base amounts. Typically these are annual premiums, net amounts at risk, or best estimates. Future capital requirements are obtained by scaling the current capital requirements for each component in proportion to the projected base amounts.\n\nThis spreadsheet contains simplified projection of future capital requirements under both the old (pre-2019) and the new BSCR basis. The projected amounts under the old and the new basis are used, together with a transitional rule, to calculate the Risk Margin under the transitional arrangement."]
[]
["General Instructions"]
{"$rows_left_out":27}
{"sheet":"Simplified Capital Proj - Old","index":1,"n_rows":122,"n_cols":37,"rows_kept":122,"cut":false,"hidden":false,"merged":[[19,1,19,3],[19,34,19,36],[19,25,19,27],[19,30,19,32],[19,5,19,7],[19,9,19,11],[19,13,19,15],[19,17,19,19],[19,21,19,23]]}
[]
[]
[]
[]
[null,"Simplified Capital Projection - Old (2018) Basis"]
[]
[null,"Current Bermuda Solvency Capital Requirement"]
[null,"BMA Approved Adj",null,200000]
[null,"Credit Risk",null,500000]
[null,"Mortality",null,500000]
[null,"Stop Loss",null,5000]
[null,"Riders",null,5000]
[null,"Morbidity & Disability",null,50000]
[null,"Longevity",null,400000]
[null,"Variable Annuities",null,1000000]
{"$rows_left_out":108}
{"sheet":"Simplified Capital Proj - New","index":2,"n_rows":122,"n_cols":37,"rows_kept":122,"cut":false,"hidden":false,"merged":[[19,25,19,27],[19,30,19,32],[19,34,19,36],[19,1,19,3],[19,5,19,7],[19,9,19,11],[19,13,19,15],[19,17,19,19],[19,21,19,23]]}
[]
[]
[]
[]
[null,"Simplified Capital Projection - New Basis"]
[]
[null,"Current Bermuda Solvency Capital Requirement"]
[null,"BMA Approved Adj",null,200000]
[null,"Credit Risk",null,500000]
[null,"Mortality",null,500000]
[null,"Stop Loss",null,5000]
[null,"Riders",null,5000]
[null,"Morbidity & Disability",null,50000]
[null,"Longevity",null,400000]
[null,"Variable Annuities",null,1000000]
{"$rows_left_out":108}
{"sheet":"Capital Req't Calc - Old","index":3,"n_rows":113,"n_cols":16,"rows_kept":113,"cut":false,"hidden":false,"merged":[[10,5,10,7],[6,1,6,2],[10,8,10,15]]}
[]
[]
[]
[]
[null,"Capital Requirement Calculation - Old Basis"]
[]
[null,"Risk Margin - Old Basis",null,{"$f":"SUM(D14:D113)","v":442548.0827963411}]
[]
[null,"Cost of Capital",null,0.06]
[null,null,"Currency"]
[null,null,{"$f":"Summary!D11","v":"USD"},null,null,"Future Capital Req't calculation",null,null,"Risk Component"]
[null,"t","Yield curve","Discounted CoC","Total BSCR","BMA Approved Adjustments","Operational Risk","BSCR (excl adj and OR)","Counterparty Credit Risk","Insurance Risk - Mortality","Insurance Risk - Stop Loss","Insurance Risk - Riders","Insurance Risk - Morbidity and Disability","Insurance Risk - Longevity","Insurance Risk - Variable Annuities","Insurance Risk - Other"]
[null,0,"N/A","N/A",{"$f":"H13+F13+G13","v":1490997.25019072},{"$f":"'Simplified Capital Proj - Old'!D22","v":200000},{"$f":"'Simplified Capital Proj - Old'!$D$18*H13","v":37601.861656040383},{"$f":"((J13+K13+L13)^2+M13^2+N13^2+-0.5*((J13+K13+L13)*N13)+O13^2+P13^2+I13^2)^0.5","v":1253395.3885346795},{"$f":"'Simplified Capital Proj - Old'!H22","v":500000},{"$f":"'Simplified Capital Proj - Old'!L22","v":500000},{"$f":"'Simplified Capital Proj - Old'!P22","v":5000},{"$f":"'Simplified Capital Proj - Old'!T22","v":5000},{"$f":"'Simplified Capital Proj - Old'!X22","v":50000},{"$f":"'Simplified Capital Proj - Old'!AB22","v":400000},{"$f":"'Simplified Capital Proj - Old'!AG22","v":1000000},{"$f":"'Simplified Capital Proj - Old'!AK22","v":20000}]
[null,1,{"$f":"HLOOKUP($C$11,'Risk-free rates'!$B$9:$J$110,2+B14,FALSE)","v":1.6848943187723647E-2},{"$f":"'Capital Req''t Calc - Old'!$D$9*E13*(1+C14)^(-B14)","v":87977.506994298688},1321790.1922857806,{"$f":"'Simplified Capital Proj - Old'!D23","v":180000},{"$f":"'Simplified Capital Proj - Old'!$D$18*H14","v":33256.025018032444},{"$f":"((J14+K14+L14)^2+M14^2+N14^2+-0.5*((J14+K14+L14)*N14)+O14^2+P14^2+I14^2)^0.5","v":1108534.1672677482},{"$f":"'Simplified Capital Proj - Old'!H23","v":400000},{"$f":"'Simplified Capital Proj - Old'!L23","v":450000},{"$f":"'Simplified Capital Proj - Old'!P23","v":4000},{"$f":"'Simplified Capital Proj - Old'!T23","v":4000},{"$f":"'Simplified Capital Proj - Old'!X23","v":40000},{"$f":"'Simplified Capital Proj - Old'!AB23","v":360000},{"$f":"'Simplified Capital Proj - Old'!AG23","v":900000},{"$f":"'Simplified Capital Proj - Old'!AK23","v":18000}]
[null,2,{"$f":"HLOOKUP($C$11,'Risk-free rates'!$B$9:$J$110,2+B15,FALSE)","v":1.6004625690861696E-2},{"$f":"'Capital Req''t Calc - Old'!$D$9*E14*(1+C15)^(-B15)","v":76828.509006797773},1155127.1319786231,{"$f":"'Simplified Capital Proj - Old'!D24","v":160000},{"$f":"'Simplified Capital Proj - Old'!$D$18*H15","v":28984.285397435622},966142.84658118745,{"$f":"'Simplified Capital Proj - Old'!H24","v":300000},{"$f":"'Simplified Capital Proj - Old'!L24","v":400000},{"$f":"'Simplified Capital Proj - Old'!P24","v":3000},{"$f":"'Simplified Capital Proj - Old'!T24","v":3000},{"$f":"'Simplified Capital Proj - Old'!X24","v":30000},{"$f":"'Simplified Capital Proj - Old'!AB24","v":320000},{"$f":"'Simplified Capital Proj - Old'!AG24","v":800000},{"$f":"'Simplified Capital Proj - Old'!AK24","v":16000}]
{"$rows_left_out":99}
{"sheet":"Simplified Capital ProjectionV2","index":4,"n_rows":94,"n_cols":28,"rows_kept":94,"cut":false,"hidden":true,"merged":[[24,21,24,23],[24,25,24,27],[6,6,7,11],[8,6,8,10],[9,6,9,10],[24,1,24,3],[24,5,24,7],[24,9,24,11],[2,1,4,3],[13,6,13,10],[24,13,24,15],[24,17,24,19]]}
[]
[]
[null,"Projected Capital Requirements for Operational Risk are determined on the Summary and Discount of CoC worksheet",null,null,"May want to remove comment"]
[]
[]
[]
[null,"Bermuda Solvency Capital Requirement Charges",null,null,null,null,"Simplification for the calculation of the overall unavoidable market risk in the full calculation (TP5.71)"]
[null,"Fixed IncomeRisk",null,100]
[null,"Equity Risk",null,100,null,null,"Net Best estimates at t=0",null,null,null,null,1000]
[null,"Credit Risk",null,100,"*",null,"Modified duration of the undertaking",null,null,null,null,2]
[null,"Interest Rate",null,25,null,null,"Longest duration of available instruments",null,null,null,null,1]
[null,"Mortality",null,100,"*",null,"Absolute decrease of risk-free rate for this duration",null,null,null,null,4]
[null,"Stop Loss",null,50,"*"]
[null,"Riders",null,25,"*",null,"Overall unavoidable market risk",null,null,null,null,{"$f":"MAX(0,0.5*L9*(L10-L11)*(L10-L11+1)*L12)","v":4000}]
[null,"Morbidity & Disability",null,15,"*"]
{"$rows_left_out":80}
{"sheet":"Summary and Discount of CoC V2","index":5,"n_rows":239,"n_cols":19,"rows_kept":239,"cut":false,"hidden":true,"merged":[[3,5,3,7],[3,8,3,18],[74,1,74,2]]}
["Summary and Discount of Cost of Capital"]
[]
[null,"Cost of Capital",null,0.06]
[null,null,"Currency","USD",null,"Future SCRs calculation",null,null,"Future BSCRs Calculation"]
[null,"t","Yield curve","Discounted CoC","Total BSCR","BSCR (excl adj and OR)","BMA Approved Adjustments","Operational Risk","Fixed Income Investment Risk","Equity Investment Risk","Counterparty Credit Default Risk","Interest and Liquidity Risk","Insurance Risk - Mortality","Insurance Risk - Stop Loss","Insurance Risk - Riders","Insurance Risk - Morbidity and Disability","Insurance Risk - Longevity","Insurance Risk - Variable Annuities","Insurance Risk - Other"]
[null,0,"N/A","N/A",{"$f":"F6+G6+H6","v":319.67573120323601},{"$f":"(I6^2+J6^2+K6^2+L6^2+(M6+N6+O6)^2+O6^2+P6^2+Q6^2+-0.5*((M6+N6+O6)*Q6)+R6^2+S6^2)^0.5","v":269.67573120323601},null,{"$f":"'Simplified Capital ProjectionV2'!D21","v":50},{"$f":"+'Simplified Capital ProjectionV2'!D8","v":100},{"$f":"+'Simplified Capital ProjectionV2'!D9","v":100},{"$f":"'Simplified Capital ProjectionV2'!D27","v":100},{"$f":"+'Simplified Capital ProjectionV2'!D11","v":25},{"$f":"'Simplified Capital ProjectionV2'!H27","v":100},{"$f":"'Simplified Capital ProjectionV2'!L27","v":50},{"$f":"'Simplified Capital ProjectionV2'!P27","v":25},{"$f":"'Simplified Capital ProjectionV2'!T27","v":15},{"$f":"'Simplified Capital ProjectionV2'!X27","v":50},{"$f":"+'Simplified Capital ProjectionV2'!D17","v":100},{"$f":"'Simplified Capital ProjectionV2'!AB27","v":50}]
[null,1,{"$f":"HLOOKUP($D$4,'Risk-free rates'!$B$9:$J$110,2+B7,FALSE)","v":1.6848943187723647E-2},{"$f":"'Summary and Discount of CoC V2'!$D$3*E6*(1+C7)^(-B7)","v":18.862726858981631},{"$f":"F7+G7+H7","v":205.72547630948432},{"$f":"(I7^2+J7^2+K7^2+L7^2+(M7+N7+O7)^2+O7^2+P7^2+Q7^2+-0.5*((M7+N7+O7)*Q7)+R7^2+S7^2)^0.5","v":173.54826418031382},null,{"$f":"IF(F7<>0,H$6*F7/F$6,0)","v":32.177212129170506},null,null,{"$f":"'Simplified Capital ProjectionV2'!D28","v":80},null,{"$f":"'Simplified Capital ProjectionV2'!H28","v":90},{"$f":"'Simplified Capital ProjectionV2'!L28","v":40},{"$f":"'Simplified Capital ProjectionV2'!P28","v":20},{"$f":"'Simplified Capital ProjectionV2'!T28","v":12},{"$f":"'Simplified Capital ProjectionV2'!X28","v":45},null,{"$f":"'Simplified Capital ProjectionV2'!AB28","v":45}]
[null,2,{"$f":"HLOOKUP($D$4,'Risk-free rates'!$B$9:$J$110,2+B8,FALSE)","v":1.6004625690861696E-2},{"$f":"'Summary and Discount of CoC V2'!$D$3*E7*(1+C8)^(-B8)","v":11.957708342682041},168.60734016365086,142.23571984561403,null,{"$f":"IF(F8<>0,H$6*F8/F$6,0)","v":26.371620318036843},null,null,{"$f":"'Simplified Capital ProjectionV2'!D29","v":60},null,{"$f":"'Simplified Capital ProjectionV2'!H29","v":80},{"$f":"'Simplified Capital ProjectionV2'!L29","v":30},{"$f":"'Simplified Capital ProjectionV2'!P29","v":15},{"$f":"'Simplified Capital ProjectionV2'!T29","v":9},{"$f":"'Simplified Capital ProjectionV2'!X29","v":40},null,{"$f":"'Simplified Capital ProjectionV2'!AB29","v":40}]
[null,3,{"$f":"HLOOKUP($D$4,'Risk-free rates'!$B$9:$J$110,2+B9,FALSE)","v":1.5927022026966053E-2},{"$f":"'Summary and Discount of CoC V2'!$D$3*E8*(1+C9)^(-B9)","v":9.648064354799514},132.19290878625128,111.51681487560519,null,20.676093910646088,null,null,{"$f":"'Simplified Capital ProjectionV2'!D30","v":40},null,{"$f":"'Simplified Capital ProjectionV2'!H30","v":70},{"$f":"'Simplified Capital ProjectionV2'!L30","v":20},{"$f":"'Simplified Capital ProjectionV2'!P30","v":10},{"$f":"'Simplified Capital ProjectionV2'!T30","v":6},{"$f":"'Simplified Capital ProjectionV2'!X30","v":35},null,{"$f":"'Simplified Capital ProjectionV2'!AB30","v":35}]
[null,4,{"$f":"HLOOKUP($D$4,'Risk-free rates'!$B$9:$J$110,2+B10,FALSE)","v":1.6082651076508636E-2},{"$f":"'Summary and Discount of CoC V2'!$D$3*E9*(1+C10)^(-B10)","v":7.4412049237266862},97.275698566967009,82.060952955714569,null,15.214745611252441,null,null,{"$f":"'Simplified Capital ProjectionV2'!D31","v":20},null,{"$f":"'Simplified Capital ProjectionV2'!H31","v":60},{"$f":"'Simplified Capital ProjectionV2'!L31","v":10},{"$f":"'Simplified Capital ProjectionV2'!P31","v":5},{"$f":"'Simplified Capital ProjectionV2'!T31","v":3},{"$f":"'Simplified Capital ProjectionV2'!X31","v":30},null,{"$f":"'Simplified Capital ProjectionV2'!AB31","v":30}]
[null,5,{"$f":"HLOOKUP($D$4,'Risk-free rates'!$B$9:$J$110,2+B11,FALSE)","v":1.6360538647830047E-2},{"$f":"'Summary and Discount of CoC V2'!$D$3*E10*(1+C11)^(-B11)","v":5.3816646888770494},66.266313855720881,55.901699437494742,null,10.364614418226141,null,null,{"$f":"'Simplified Capital ProjectionV2'!D32","v":0},null,{"$f":"'Simplified Capital ProjectionV2'!H32","v":50},{"$f":"'Simplified Capital ProjectionV2'!L32","v":0},{"$f":"'Simplified Capital ProjectionV2'!P32","v":0},{"$f":"'Simplified Capital ProjectionV2'!T32","v":0},{"$f":"'Simplified Capital ProjectionV2'!X32","v":25},null,{"$f":"'Simplified Capital ProjectionV2'!AB32","v":25}]
[null,6,{"$f":"HLOOKUP($D$4,'Risk-free rates'!$B$9:$J$110,2+B12,FALSE)","v":1.6691331924664876E-2},{"$f":"'Summary and Discount of CoC V2'!$D$3*E11*(1+C12)^(-B12)","v":3.6000566781646661},53.013051084576709,44.721359549995796,null,8.291691534580913,null,null,{"$f":"'Simplified Capital ProjectionV2'!D33","v":0},null,{"$f":"'Simplified Capital ProjectionV2'!H33","v":40},{"$f":"'Simplified Capital ProjectionV2'!L33","v":0},{"$f":"'Simplified Capital ProjectionV2'!P33","v":0},{"$f":"'Simplified Capital ProjectionV2'!T33","v":0},{"$f":"'Simplified Capital ProjectionV2'!X33","v":20},null,{"$f":"'Simplified Capital ProjectionV2'!AB33","v":20}]
[null,7,{"$f":"HLOOKUP($D$4,'Risk-free rates'!$B$9:$J$110,2+B13,FALSE)","v":1.7028330838087857E-2},{"$f":"'Summary and Discount of CoC V2'!$D$3*E12*(1+C13)^(-B13)","v":2.826198707266887},39.75978831343253,33.541019662496844,null,6.2187686509356839,null,null,{"$f":"'Simplified Capital ProjectionV2'!D34","v":0},null,{"$f":"'Simplified Capital ProjectionV2'!H34","v":30},{"$f":"'Simplified Capital ProjectionV2'!L34","v":0},{"$f":"'Simplified Capital ProjectionV2'!P34","v":0},{"$f":"'Simplified Capital ProjectionV2'!T34","v":0},{"$f":"'Simplified Capital ProjectionV2'!X34","v":15},null,{"$f":"'Simplified Capital ProjectionV2'!AB34","v":15}]
[null,8,{"$f":"HLOOKUP($D$4,'Risk-free rates'!$B$9:$J$110,2+B14,FALSE)","v":1.7355793716367307E-2},{"$f":"'Summary and Discount of CoC V2'!$D$3*E13*(1+C14)^(-B14)","v":2.0787985844358605},26.506525542288355,22.360679774997898,null,4.1458457672904565,null,null,{"$f":"'Simplified Capital ProjectionV2'!D35","v":0},null,{"$f":"'Simplified Capital ProjectionV2'!H35","v":20},{"$f":"'Simplified Capital ProjectionV2'!L35","v":0},{"$f":"'Simplified Capital ProjectionV2'!P35","v":0},{"$f":"'Simplified Capital ProjectionV2'!T35","v":0},{"$f":"'Simplified Capital ProjectionV2'!X35","v":10},null,{"$f":"'Simplified Capital ProjectionV2'!AB35","v":10}]
[null,9,{"$f":"HLOOKUP($D$4,'Risk-free rates'!$B$9:$J$110,2+B15,FALSE)","v":1.7694544236866117E-2},{"$f":"'Summary and Discount of CoC V2'!$D$3*E14*(1+C15)^(-B15)","v":1.3581478110375627},13.253262771144177,11.180339887498949,null,2.0729228836452283,null,null,{"$f":"'Simplified Capital ProjectionV2'!D36","v":0},null,{"$f":"'Simplified Capital ProjectionV2'!H36","v":10},{"$f":"'Simplified Capital ProjectionV2'!L36","v":0},{"$f":"'Simplified Capital ProjectionV2'!P36","v":0},{"$f":"'Simplified Capital ProjectionV2'!T36","v":0},{"$f":"'Simplified Capital ProjectionV2'!X36","v":5},null,{"$f":"'Simplified Capital ProjectionV2'!AB36","v":5}]
{"$rows_left_out":225}
{"sheet":"Capital Req't Calc - New","index":6,"n_rows":113,"n_cols":17,"rows_kept":113,"cut":false,"hidden":false,"merged":[[6,1,6,2],[10,5,10,7],[10,9,10,16]]}
[]
[]
[]
[]
[null,"Capital Requirement Calculation - New Basis"]
[]
[null,"Risk Margin - New Basis",null,{"$f":"SUM(D14:D113)","v":478543.84398287965}]
[]
[null,"Cost of Capital",null,0.06]
[null,null,"Currency"]
[null,null,{"$f":"Summary!D11","v":"USD"},null,null,"Future Capital Req't calculation",null,null,null,"Risk Component"]
[null,"t","Yield curve","Discounted CoC","Total BSCR","BMA Approved Adjustments","Operational Risk","Preliminary BSCR (excl adj and OR)","Long Term Insurance Risk","Counterparty Credit Risk","Insurance Risk - Mortality","Insurance Risk - Stop Loss","Insurance Risk - Riders","Insurance Risk - Morbidity and Disability","Insurance Risk - Longevity","Insurance Risk - Variable Annuities","Insurance Risk - Other"]
[null,0,"N/A","N/A",{"$f":"H13+F13+G13","v":1665585.702206214},{"$f":"'Simplified Capital Proj - New'!D22","v":200000},{"$f":"'Simplified Capital Proj - New'!$D$18*H13","v":133235.06383692854},{"$f":"SQRT(MMULT(I13:J13,MMULT('Correlation Matrix'!$M$12:$N$13,TRANSPOSE(I13:J13))))","v":1332350.6383692855},{"$f":"SQRT(MMULT(K13:Q13,MMULT('Correlation Matrix'!$C$11:$I$17,TRANSPOSE(K13:Q13))))","v":1116282.8942521694},{"$f":"'Simplified Capital Proj - New'!H22","v":500000},{"$f":"'Simplified Capital Proj - New'!L22","v":500000},{"$f":"'Simplified Capital Proj - New'!P22","v":5000},{"$f":"'Simplified Capital Proj - New'!T22","v":5000},{"$f":"'Simplified Capital Proj - New'!X22","v":50000},{"$f":"'Simplified Capital Proj - New'!AB22","v":400000},{"$f":"'Simplified Capital Proj - New'!AG22","v":1000000},{"$f":"'Simplified Capital Proj - New'!AK22","v":20000}]
[null,1,{"$f":"HLOOKUP($C$11,'Risk-free rates'!$B$9:$J$110,2+B14,FALSE)","v":1.6848943187723647E-2},{"$f":"'Capital Req''t Calc - New'!$D$9*E13*(1+C14)^(-B14)","v":98279.240787806455},1466640.4928907822,{"$f":"'Simplified Capital Proj - New'!D23","v":180000},{"$f":"'Simplified Capital Proj - New'!$D$18*H14","v":116967.31753552565},{"$f":"SQRT(MMULT(I14:J14,MMULT('Correlation Matrix'!$M$12:$N$13,TRANSPOSE(I14:J14))))","v":1169673.1753552565},{"$f":"SQRT(MMULT(K14:Q14,MMULT('Correlation Matrix'!$C$11:$I$17,TRANSPOSE(K14:Q14))))","v":1003691.6857282419},{"$f":"'Simplified Capital Proj - New'!H23","v":400000},{"$f":"'Simplified Capital Proj - New'!L23","v":450000},{"$f":"'Simplified Capital Proj - New'!P23","v":4000},{"$f":"'Simplified Capital Proj - New'!T23","v":4000},{"$f":"'Simplified Capital Proj - New'!X23","v":40000},{"$f":"'Simplified Capital Proj - New'!AB23","v":360000},{"$f":"'Simplified Capital Proj - New'!AG23","v":900000},{"$f":"'Simplified Capital Proj - New'!AK23","v":18000}]
[null,2,{"$f":"HLOOKUP($C$11,'Risk-free rates'!$B$9:$J$110,2+B15,FALSE)","v":1.6004625690861696E-2},{"$f":"'Capital Req''t Calc - New'!$D$9*E14*(1+C15)^(-B15)","v":85247.872904046788},1269738.7699345106,{"$f":"'Simplified Capital Proj - New'!D24","v":160000},{"$f":"'Simplified Capital Proj - New'!$D$18*H15","v":100885.34272131916},{"$f":"SQRT(MMULT(I15:J15,MMULT('Correlation Matrix'!$M$12:$N$13,TRANSPOSE(I15:J15))))","v":1008853.4272131915},{"$f":"SQRT(MMULT(K15:Q15,MMULT('Correlation Matrix'!$C$11:$I$17,TRANSPOSE(K15:Q15))))","v":891131.58399868198},{"$f":"'Simplified Capital Proj - New'!H24","v":300000},{"$f":"'Simplified Capital Proj - New'!L24","v":400000},{"$f":"'Simplified Capital Proj - New'!P24","v":3000},{"$f":"'Simplified Capital Proj - New'!T24","v":3000},{"$f":"'Simplified Capital Proj - New'!X24","v":30000},{"$f":"'Simplified Capital Proj - New'!AB24","v":320000},{"$f":"'Simplified Capital Proj - New'!AG24","v":800000},{"$f":"'Simplified Capital Proj - New'!AK24","v":16000}]
{"$rows_left_out":99}
{"sheet":"Summary","index":7,"n_rows":113,"n_cols":9,"rows_kept":113,"cut":false,"hidden":false,"merged":[[6,1,6,3],[6,6,6,7]]}
[]
[]
[]
[]
[null,"Risk Margin Calculation"]
[]
[null,"Risk Margin",null,null,{"$f":"SUM(E14:E113)","v":452836.49191351963},null,"Calendar Year End",null,2019]
[]
[null,"Cost of Capital",null,null,0.06]
[null,null,null,"Currency"]
[null,null,null,"USD"]
[null,"t","Cal Year","Yield curve","Discounted CoC","BSCR","Transitional Weight","Old Basis BSCR","New Basis BSCR"]
[null,0,{"$f":"I7","v":2019},"N/A","N/A",{"$f":"G13*H13+(1-G13)*I13","v":1508456.0953922693},{"$f":"MIN(MAX((2028-C13)/10,0),1)","v":0.9},{"$f":"'Capital Req''t Calc - Old'!E13","v":1490997.25019072},{"$f":"'Capital Req''t Calc - New'!E13","v":1665585.702206214}]
[null,1,{"$f":"C13+1","v":2020},{"$f":"HLOOKUP($D$11,'Risk-free rates'!$B$9:$J$110,2+B14,FALSE)","v":1.6848943187723647E-2},{"$f":"Summary!$E$9*F13*(1+D14)^(-B14)","v":89007.680373649477},{"$f":"G14*H14+(1-G14)*I14","v":1350760.2524067808},{"$f":"MIN(MAX((2028-C14)/10,0),1)","v":0.8},{"$f":"'Capital Req''t Calc - Old'!E14","v":1321790.1922857806},{"$f":"'Capital Req''t Calc - New'!E14","v":1466640.4928907822}]
[null,2,{"$f":"C14+1","v":2021},{"$f":"HLOOKUP($D$11,'Risk-free rates'!$B$9:$J$110,2+B15,FALSE)","v":1.6004625690861696E-2},{"$f":"Summary!$E$9*F14*(1+D15)^(-B15)","v":78512.38178624757},1189510.6233653892,0.7,{"$f":"'Capital Req''t Calc - Old'!E15","v":1155127.1319786231},{"$f":"'Capital Req''t Calc - New'!E15","v":1269738.7699345106}]
{"$rows_left_out":99}
{"sheet":"Risk-free rates","index":8,"n_rows":110,"n_cols":10,"rows_kept":110,"cut":false,"hidden":false,"merged":[]}
["Summary and Discount of Cost of Capital"]
[]
[]
[]
[]
[]
[null,null,null,null,null,"Risk Free Spot Rates - End December 2019"]
[]
[null,null,"USD","EUR","GBP","CHF","CAD","JPY","AUD","NZD"]
[null,"Maturity (years)"]
[null,1,1.6848943187723647E-2,-4.9031837991520937E-3,7.3975561189533858E-3,-8.1292479640419704E-3,1.9305040217489543E-2,-8.6249526027221243E-4,8.8039120983526252E-3,1.130260741650823E-2]
[null,2,1.6004625690861696E-2,-4.636175852645974E-3,7.2866405349660823E-3,-7.8640968576736414E-3,1.9242801420335853E-2,-8.7249654925247722E-4,9.0242901753301297E-3,1.1743112466216177E-2]
[null,3,1.5927022026966053E-2,-4.124439231556809E-3,7.534917957885634E-3,-7.2942365323496183E-3,1.9257438408410987E-2,-8.3248682777514738E-4,9.6579990676710636E-3,1.2110345826821689E-2]
[null,4,1.6082651076508636E-2,-3.5009099643857899E-3,7.8739568474996968E-3,-6.6750481659224592E-3,1.9379314382238499E-2,-7.8746853200262201E-4,1.034324830125577E-2,1.2842812122181968E-2]
[null,5,1.6360538647830047E-2,-2.8486144942996283E-3,8.1660496277600192E-3,-6.0556729186271863E-3,1.9501754814811312E-2,-6.5735546818446178E-4,1.1016651851116555E-2,1.356538578349098E-2]
{"$rows_left_out":96}
{"sheet":"Correlation Matrix","index":9,"n_rows":17,"n_cols":14,"rows_kept":17,"cut":false,"hidden":false,"merged":[]}
[]
[]
[]
[]
[null,"Correlation Matrices"]
[]
[]
[]
[null,"Long-term Insurance Risk",null,null,null,null,null,null,null,null,"Overall BSCR"]
[null,null,"Mort","Stop Loss","Riders","Morb & Dis","Long","VA Guar","Other",null,null,"Market","Credit","LT Ins"]
[null,"Mort",1,0.75,0.75,0.25,-0.5,0,0.125,null,"Market",1,0.25,0.125]
[null,"Stop Loss",0.75,1,0.75,0,-0.5,0,0.25,null,"Credit",0.25,1,0.25]
[null,"Riders",0.75,0.75,1,0,-0.5,0,0.25,null,"LT Ins",0.125,0.25,1]
[null,"Morb & Dis",0.25,0,0,1,0,0,0.25]
[null,"Long",-0.5,-0.5,-0.5,0,1,0,0.25]
{"$rows_left_out":2}