{"text_format":"1","workbook":"xlsx","n_sheets":7,"sheets":["I-Instructions","II-Applicant Details","III-Business Plan Information","IV-Insurance","V-Prior Issues","VI-Documentation Checklist","VII-Declarations"],"not_rendered":{"charts":0,"images":1,"macros":1,"external_links":0,"defined_names":7,"comments":0,"pivot_tables":0},"unopened":[],"bounds":{"document_bytes":16777216,"sheet_cells":100000,"rows_first":2000,"rows_last":500,"rows_between":2000,"halvings":0,"cell_chars":16384,"cell_head_chars":4096},"cells_cut":0,"cells_raw":0,"read":"whole","date_system":"1900"}

{"sheet":"I-Instructions","index":0,"n_rows":8,"n_cols":10,"rows_kept":8,"cut":false,"hidden":false,"merged":[[7,1,7,8],[0,0,0,10],[5,1,5,8],[6,1,6,8],[4,1,4,8]]}
["Investment Business Test Licence Application Form"]
["INSTRUCTIONS",null,null,null,null,null,null,null,null,"Version 2022.1"]
["Completed application forms should be e-mailed to investmentInfo@bma.bm"]
[]
[1,"Applicants for a Standard licence  or Class A Registration or Class B Registration should not complete this form. They should complete the  Standard Application Form instead, as applicable, which can be found on the Bermuda Monetary Authority's (BMA or Authority) website (www.bma.bm). "]
[2,"This form must be completed by a person who is/will be responsible for the conduct of the business of the applicant or having legal capacity to sign on behalf of the applicant. "]
[3,"Completed application forms should be e-mailed (signed) to investmentInfo@bma.bm. If the total size of the documents exceeds the maximum size for an e-mail, please contact the Banking, Trust, Corporate Services and Investment Department (BTCSI) at the above email address to receive instructions on how to submit via the Authority’s secure file sharing portal."]
[4,"The 'IV-Declarations' tab should be signed electronically by two directors, or one director and an officer of the applicant."]

{"sheet":"II-Applicant Details","index":1,"n_rows":43,"n_cols":21,"rows_kept":43,"cut":false,"hidden":false,"merged":[[24,0,24,6],[25,0,25,6],[21,0,21,6],[16,0,16,6],[15,0,15,6],[20,0,20,6],[17,0,17,6],[23,0,23,6],[22,0,22,6],[19,0,19,6],[4,8,4,17],[5,8,5,17],[6,8,6,17],[7,8,7,17],[8,8,8,17],[36,18,36,19],[38,7,38,8],[38,9,38,17],[37,18,37,19],[35,0,35,6],[35,8,35,17],[37,8,37,17],[36,0,36,6],[38,0,38,6],[37,0,37,6],[36,8,36,17],[31,0,31,6],[32,0,32,6],[33,0,33,6],[28,0,28,6],[26,0,26,6],[27,0,27,6],[29,0,29,6],[30,0,30,6],[34,0,34,6],[0,0,0,18],[1,0,1,18],[11,0,11,6],[14,0,14,6],[12,7,12,17],[14,7,14,17],[11,7,11,17],[12,0,12,6],[10,8,10,17],[10,0,10,6],[3,7,3,17],[9,8,9,17],[3,0,9,6],[13,0,13,6],[18,0,18,6],[13,7,13,17],[18,7,18,17],[19,7,19,17],[24,7,24,17],[25,7,25,17],[15,7,15,17],[16,7,16,17],[21,7,21,17],[22,7,22,17],[23,7,23,17],[20,7,20,17],[17,7,17,17],[31,7,31,17],[32,7,32,17],[33,7,33,17],[34,8,34,17],[26,7,26,17],[27,7,27,17],[28,7,28,17],[29,7,29,17],[30,7,30,17]]}
["Investment Business Test Licence Application Form",null,null,null,null,null,null,null,null,null,null,null,null,null,null,null,null,null,null,null,"Check"]
["APPLICANT DETAILS"]
[]
["Please indicate all investment activities in relation to which pilot or beta testing will be carried out",null,null,null,null,null,null,"Investment Activity (please select as applicable)",null,null,null,null,null,null,null,null,null,null,null,null,{"$f":"IF(OR(H4=0,H4=\"Select\"),0,1)","v":1}]
[null,null,null,null,null,null,null,"Select","Dealing in investments"]
[null,null,null,null,null,null,null,"Select","Arranging deals in investments"]
[null,null,null,null,null,null,null,"Select","Managing investments"]
[null,null,null,null,null,null,null,"Select","Investment Advice"]
[null,null,null,null,null,null,null,"Select","Safeguarding and administering investments"]
[null,null,null,null,null,null,null,"Select","Promotion of investments"]
["Does the applicant wish to apply for an exemption from the requirement to comply with any applicable prudential standard or requirement pursuant to section 10B of the Investment Business Act 2003? If so, please provide relevant details.",null,null,null,null,null,null,"Select",null,null,null,null,null,null,null,null,null,null,null,null,{"$f":"IF(OR(H11=0,H11=\"Select\"),0,1)","v":0}]
["Name of applicant",null,null,null,null,null,null,null,null,null,null,null,null,null,null,null,null,null,null,null,{"$f":"IF(OR(H12=0,H12=\"Enter Legal Company Name\"),0,1)","v":0}]
["Any other names which the applicant uses (has used) or proposes to use for purposes of or in connection with any business carried on",null,null,null,null,null,null,null,null,null,null,null,null,null,null,null,null,null,null,null,{"$f":"IF(OR(H13=0,H13=\"Enter Trade Name\"),0,1)","v":0}]
["Place of formation "]
["Registration number (Registrar of Companies # for Bermuda)",null,null,null,null,null,null,null,null,null,null,null,null,null,null,null,null,null,null,null,{"$f":"IF(OR(H15=0,H15=\"Enter Registration Number\"),0,1)","v":0}]
["Registration date",null,null,null,null,null,null,null,null,null,null,null,null,null,null,null,null,null,null,null,{"$f":"IF(H16=0,0,1)","v":0}]
["Registered office address",null,null,null,null,null,null,null,null,null,null,null,null,null,null,null,null,null,null,null,{"$f":"IF(OR(H17=0,H17=\"Enter Head Office Address\"),0,1)","v":0}]
["Address of principal place of business in Bermuda"]
["Other places of business in Bermuda"]
["Other places of business outside Bermuda"]
{"$rows_left_out":24}
{"sheet":"III-Business Plan Information","index":2,"n_rows":70,"n_cols":21,"rows_kept":70,"cut":false,"hidden":false,"merged":[[27,15,27,18],[28,15,28,18],[29,15,29,18],[30,15,30,18],[31,15,31,18],[32,15,32,18],[33,15,33,18],[18,15,18,18],[19,15,19,18],[20,15,20,18],[21,15,21,18],[22,15,22,18],[23,15,23,18],[24,15,24,18],[25,15,25,18],[26,15,26,18],[8,15,8,18],[9,15,9,18],[10,15,10,18],[12,15,12,18],[13,15,13,18],[14,15,14,18],[15,15,15,18],[16,15,16,18],[17,15,17,18],[37,2,37,10],[36,15,36,18],[37,15,37,18],[38,2,38,10],[38,15,38,18],[39,2,39,10],[39,15,39,18],[40,15,40,18],[40,2,40,10],[7,1,10,1],[11,1,23,1],[24,1,33,1],[24,2,24,10],[30,2,30,10],[29,2,29,10],[28,2,28,10],[27,2,27,10],[25,2,25,10],[26,2,26,10],[32,2,32,10],[33,2,33,10],[31,2,31,10],[12,2,12,10],[20,2,20,10],[21,2,21,10],[22,2,22,10],[23,2,23,10],[7,2,7,10],[15,2,15,10],[18,2,18,10],[19,2,19,10],[7,15,7,18],[11,2,11,10],[11,15,11,18],[10,2,10,10],[8,2,8,10],[9,2,9,10],[51,2,51,10],[51,15,51,18],[52,2,52,10],[52,15,52,18],[47,2,47,10],[46,15,46,18],[45,15,45,18],[49,2,49,10],[49,15,49,18],[50,2,50,10],[50,15,50,18],[48,15,48,18],[48,2,48,10],[16,2,16,10],[17,2,17,10],[13,2,13,10],[14,2,14,10],[36,2,36,10],[53,2,53,10],[53,15,53,18],[54,2,54,10],[54,15,54,18],[64,15,64,18],[59,2,59,10],[59,15,59,18],[55,2,55,10],[55,15,55,18],[60,2,60,10],[60,15,60,18],[57,2,57,10],[57,11,57,13],[57,15,57,18],[62,0,64,0],[58,15,58,18],[58,2,58,10],[58,0,60,0],[63,15,63,18],[62,2,62,10],[62,15,62,18],[63,2,63,10],[64,2,64,10],[3,0,3,18],[0,0,0,18],[1,0,1,18],[5,15,5,18],[6,15,6,18],[5,11,5,13],[5,2,5,10],[6,2,6,10],[6,0,55,0],[34,15,34,18],[35,15,35,18],[41,15,41,18],[43,2,43,10],[43,15,43,18],[34,2,34,10],[35,2,35,10],[41,2,41,10],[44,2,44,10],[42,2,42,10],[46,2,46,10],[45,2,45,10],[44,15,44,18],[42,15,42,18],[47,15,47,18]]}
["Investment Business Test Licence Application Form",null,null,null,null,null,null,null,null,null,null,null,null,null,null,null,null,null,null,null,"Check"]
["BUSINESS PLAN INFORMATION"]
[]
["Specify which of the following information has been included in the business plan, including the relevant section(s) that such information can be found in the document. In relation to the information that has not been included in the business plan, please explain the reason thereto.  "]
[]
[null,null,"DESCRIPTION",null,null,null,null,null,null,null,null,"Y/N",null,null,null,"SECTION/S"]
["CORPORATE STRUCTURE/BUSINESS MODEL",1,"Description of proposed investment business service(s) and/or product(s) to be provided by the applicant to clients/customers. Include information on the financial standing of the company, such as any funds raised from investors (if any)",null,null,null,null,null,null,null,null,"Select",null,null,null,null,null,null,null,null,{"$f":"IF(OR(L7=0,L7=\"Select\"),0,1)","v":0}]
[null,2,"Overview of the business strategy and plan, including:\n",null,null,null,null,null,null,null,null,"Select"]
[null,null," (a) The roadmap to deploy the products, services and delivery mechanisms on a broader scale once the sandbox period is completed",null,null,null,null,null,null,null,null,"Select"]
[null,null,"(b) The ability of the company to meet the legal and regulatory requirements that will apply upon exit",null,null,null,null,null,null,null,null,"Select"]
[null,null,"(c)Details of any current or past participation or rejection of participation in a regulatory sandbox in another jurisdiction/country",null,null,null,null,null,null,null,null,"Select"]
[null,3,"Description of the proposed product, service or distribution channel to be offered in the General Regulatory Sandbox (GRS), including:\n \n",null,null,null,null,null,null,null,null,"Select"]
[null,null,"(a) How the sandbox eligibility criteria outlined in the General Regulatory Sandbox Guidance Notes are met, including:",null,null,null,null,null,null,null,null,"Select"]
[null,null,"(i) Demonstrate how the proposed product, service or business model is innovative or significantly different from existing solutions already in the market (i.e., unique)",null,null,null,null,null,null,null,null,"Select"]
[null,null,"(ii) Define objectives for testing the expected outcomes of the proof of concept stage",null,null,null,null,null,null,null,null,"Select"]
[null,null,"(iii) Clearly demonstrate the benefits of the proposed product or service to the industry",null,null,null,null,null,null,null,null,"Select"]
[null,null,"(iv) Document scope, method, and results of research and due diligence conducted on the proposal (indicate all activities in relation to the pilot or beta testing that will be carried out)",null,null,null,null,null,null,null,null,"Select"]
[null,null,"(v) Document risks and exposures identified from the proposed product or service and the risk mitigation plans",null,null,null,null,null,null,null,null,"Select"]
[null,null,"(vi) Document the exit or transition strategy in case the testing is unsuccessful or discontinued",null,null,null,null,null,null,null,null,"Select"]
[null,null,"(vii) Document the applicant's intention, ability, and resources to deploy the proposed product or service upon successful testing and exit from the sandbox",null,null,null,null,null,null,null,null,"Select"]
{"$rows_left_out":51}
{"sheet":"IV-Insurance","index":3,"n_rows":18,"n_cols":13,"rows_kept":18,"cut":false,"hidden":false,"merged":[[15,0,15,4],[15,6,15,9],[16,0,16,4],[16,6,16,9],[10,1,10,4],[11,1,11,4],[12,1,12,4],[13,1,13,4],[14,0,14,4],[14,6,14,9],[9,1,9,4],[0,0,0,9],[1,0,1,9],[2,0,3,5],[2,6,3,6],[2,7,3,7],[2,8,3,8],[2,9,3,9],[4,1,4,4],[5,1,5,4],[6,1,6,4],[7,1,7,4],[8,1,8,4]]}
["Investment Business Test Licence Application Form",null,null,null,null,null,null,null,null,null,null,null,"Check"]
["Insurance Cover"]
["Indicate below whether the Applicant has cover in respect of the following:-",null,null,null,null,null,"Limits","Deductible","Insurer","Broker"]
[]
["a","Errors and omissions",null,null,null,"Select",null,null,null,null,null,null,{"$f":"IF(OR(#REF!=0,#REF!=\"Select\"),0,1)","v":{"$error":"#REF!"}}]
["b","Directors and officers liability\n",null,null,null,"Select",null,null,null,null,null,null,{"$f":"IF(OR(#REF!=0,#REF!=\"Select\"),0,1)","v":{"$error":"#REF!"}}]
["c","Fidelity and forgery ",null,null,null,"Select"]
["d","Loss of property",null,null,null,"Select",null,null,null,null,null,null,{"$f":"IF(OR(#REF!=0,#REF!=\"Select\"),0,1)","v":{"$error":"#REF!"}}]
["e","Computer crime",null,null,null,"Select",null,null,null,null,null,null,{"$f":"IF(OR(#REF!=0,#REF!=\"Select\"),0,1)","v":{"$error":"#REF!"}}]
["f","Computer damage",null,null,null,"Select"]
["g","Business interruption",null,null,null,"Select"]
["h","Office contents",null,null,null,"Select"]
["i","Political risk",null,null,null,"Select"]
["j","Other insurance (please provide details)",null,null,null,"Select"]
["Has any application for insurance by the applicant  or any predecessors in business ever been refused?",null,null,null,null,"Select"]
["Have any material insurance claims been made by  the applicant or any predecessors in business?",null,null,null,null,"Select",null,null,null,null,null,null,{"$f":"SUM(M5:M15)","v":{"$error":"#REF!"}}]
["Name(s) and address(es) of insurer(s):"]
[null,null,null,null,null,null,null,null,null,null,null,null,{"$f":"M16/#REF!","v":{"$error":"#REF!"}}]

{"sheet":"V-Prior Issues","index":4,"n_rows":19,"n_cols":19,"rows_kept":19,"cut":false,"hidden":false,"merged":[[12,1,12,11],[13,1,13,11],[14,1,14,11],[15,1,15,11],[6,1,6,11],[7,1,7,11],[8,1,8,11],[9,1,9,11],[10,1,10,11],[11,1,11,11],[5,1,5,11],[0,0,0,15],[1,0,1,15],[2,0,3,12],[2,13,3,15],[4,1,4,11],[4,13,4,15],[5,13,5,15],[6,13,6,15],[7,13,7,15],[8,13,8,15],[9,13,9,15],[10,13,10,15],[11,13,11,15],[12,13,12,15],[13,13,13,15],[14,13,14,15],[15,13,15,15]]}
["Investment Business Test Licence Application Form",null,null,null,null,null,null,null,null,null,null,null,null,null,null,null,null,null,"Check"]
["Prior Issues"]
["If the answer to any of the questions below is yes, please give full particulars in the additional information column.",null,null,null,null,null,null,null,null,null,null,null,null,"Additional information, if required"]
[]
["a","Has the applicant ever applied for and been refused a licence or an equivalent authorisation or registration to conduct banking, digital asset, digital asset issuance, corporate service provider, fund administration provider, money service,  investment, insurance or trust business in Bermuda or elsewhere?",null,null,null,null,null,null,null,null,null,null,"Select",null,null,null,null,null,{"$f":"IF(OR(F5=0,F5=\"Select\"),0,1)","v":0}]
["b","Has the applicant failed to satisfy a judgement debt under a court order in Bermuda or elsewhere within a year of the making of the order?",null,null,null,null,null,null,null,null,null,null,"Select",null,null,null,null,null,{"$f":"IF(OR(F6=0,F6=\"Select\"),0,1)","v":0}]
["c","Has the applicant made any compromise or arrangement with its creditors or otherwise failed to satisfy creditors in full?",null,null,null,null,null,null,null,null,null,null,"Select"]
["d","Has the applicant ever had a receiver appointed over any of its property in Bermuda, or has the substantial equivalent of any such person been appointed in any other jurisdiction? If so, give full particulars.",null,null,null,null,null,null,null,null,null,null,"Select",null,null,null,null,null,{"$f":"IF(OR(F8=0,F8=\"Select\"),0,1)","v":0}]
["e","Has the applicant ever had a petition for an administration order or the substantial equivalent of such a petition served on it in any jurisdiction?",null,null,null,null,null,null,null,null,null,null,"Select",null,null,null,null,null,{"$f":"IF(OR(F9=0,F9=\"Select\"),0,1)","v":0}]
["f","Has the applicant ever had a notice of resolution for liquidation in Bermuda, or had the substantial equivalent of such a notice given in any other jurisdiction?",null,null,null,null,null,null,null,null,null,null,"Select"]
["g","Has a petition ever been served in Bermuda for the compulsory liquidation of the applicant or any member of a group of which the applicant is a member or has the substantial equivalent of such a petition ever been served in any other jurisdiction?",null,null,null,null,null,null,null,null,null,null,"Select"]
["h","Has an inspector or other authorised officer of any government department or agency, professional association or other regulatory body appointed under any Bermuda law (e.g., the Companies Act 1981) or equivalent overseas enactment, ever investigated the affairs of the applicant or any member of a group of which the applicant is a member?",null,null,null,null,null,null,null,null,null,null,"Select"]
["i","Has the applicant or any member of a group of which the applicant is a member been required to produce books or records pursuant to section 110 of the Companies Act 1981 or similar provisions of regulatory legislation (e.g., section 40 of the Banks and Deposit Companies Act 1999) within Bermuda or elsewhere?\n",null,null,null,null,null,null,null,null,null,null,"Select"]
["j","Has the applicant or any member of a group of which the applicant is a member ever been censured, prosecuted or warned as to future conduct, or disciplined or publicly criticised by, or made the subject of a court order at the instigation of any supervisory or regulatory authority?",null,null,null,null,null,null,null,null,null,null,"Select"]
["k","Has the applicant or any member of a group of which the applicant is a member ever been refused entry in Bermuda or elsewhere to any professional body, stock exchange or trade association concerned with banking, trust or financial services?",null,null,null,null,null,null,null,null,null,null,"Select"]
["l","Is the applicant or any member of a group of which the applicant is a member engaged, or does it expect to be engaged in Bermuda or elsewhere in any litigation which may have a material effect on the resources of the undertaking?",null,null,null,null,null,null,null,null,null,null,"Select",null,null,null,null,null,{"$f":"IF(OR(F16=0,F16=\"Select\"),0,1)","v":0}]
[]
[null,null,null,null,null,null,null,null,null,null,null,null,null,null,null,null,null,null,{"$f":"SUM(S5:S17)","v":0}]
[null,null,null,null,null,null,null,null,null,null,null,null,null,null,null,null,null,null,{"$f":"S18/#REF!","v":{"$error":"#REF!"}}]

{"sheet":"VI-Documentation Checklist","index":5,"n_rows":50,"n_cols":21,"rows_kept":50,"cut":false,"hidden":false,"merged":[[26,11,26,14],[34,11,34,14],[11,11,11,14],[13,11,13,14],[21,11,21,14],[28,11,28,14],[30,11,30,14],[15,11,15,14],[17,11,17,14],[19,11,19,14],[22,11,22,14],[24,11,24,14],[32,11,32,14],[45,1,45,9],[42,1,42,9],[43,1,43,9],[44,11,44,14],[34,1,34,9],[35,1,35,9],[38,1,38,9],[36,1,36,9],[44,1,44,9],[39,1,39,9],[39,11,39,14],[41,11,41,14],[35,11,35,14],[36,11,36,14],[37,11,37,14],[38,11,38,14],[0,0,0,18],[1,0,1,18],[9,1,9,9],[10,1,10,9],[3,0,3,18],[4,0,4,6],[5,1,5,9],[5,11,5,14],[7,1,7,9],[7,11,7,14],[9,11,9,14],[6,1,6,9],[41,1,41,9],[13,1,13,9],[37,1,37,9],[11,1,11,9],[15,1,15,9],[17,1,17,9],[19,1,19,9],[21,1,21,9],[22,1,22,9],[28,1,28,9],[30,1,30,9],[32,1,32,9],[27,1,27,9],[24,1,24,9],[12,1,12,9],[26,1,26,9]]}
["Investment Business Test Licence Application Form",null,null,null,null,null,null,null,null,null,null,null,null,null,null,null,null,null,null,null,"Check"]
["DOCUMENTATION CHECKLIST"]
[]
["Application for an investment business test licence must include the following documentation/information. The Authority may, at its discretion and on the basis of the nature, scale and complexity of a business model, require any further documentation and/or information as it may deem necessary. \n\nNote: Whilst the Authority acknowledges that all documents required for a comprehensive  test licence application may not be available at the time of application, or may not be applicable based on the business plan, applicants are advised to submit all pertinent documents as applicable (in draft form if necessary) to assist in the Assessment and Licensing Committee review process. In cases where required documentation or information is not provided, a written explanation for any such omission is required. Applications that do not contain the necessary documents or information may be deferred or deemed insufficient for review."]
[]
[1,"A cover letter providing an executive summary of the application, indicating that it is a GRS application and highlighting how the minimum licensing criteria would be satisfied",null,null,null,null,null,null,null,null,"Select",null,null,null,null,null,null,null,null,null,{"$f":"IF(OR(K6=0,K6=\"Select\"),0,1)","v":0}]
[]
[2,"Constitutional documents (i.e., copies of memorandum of association, certificate of incorporation, registration permit (as applicable and available)",null,null,null,null,null,null,null,null,"Select"]
[]
[3,"A business plan which should, to the extent applicable to the specific applicant and its proposed business, include the matters specified in Tab 'III-Business Plan Information'",null,null,null,null,null,null,null,null,"Select",null,null,null,null,null,null,null,null,null,{"$f":"IF(OR(K10=0,K10=\"Select\"),0,1)","v":0}]
[]
[4,"Institutional Questionnaires in respect of the applicant's institutional controllers (i.e., shareholder controllers, which are undertakings), accompanied by the respective supporting documentation stated therein",null,null,null,null,null,null,null,null,"Select",null,null,null,null,null,null,null,null,null,{"$f":"IF(OR(K12=0,K12=\"Select\"),0,1)","v":0}]
[]
[5,"Personal Questionnaires in respect of the applicant's individual directors, controllers, senior executives and ultimate beneficial owners, accompanied by the respective supporting documentation stated therein",null,null,null,null,null,null,null,null,"Select",null,null,null,null,null,null,null,null,null,{"$f":"IF(OR(K14=0,K14=\"Select\"),0,1)","v":0}]
[]
[6,"Copy of the applicant's corporate governance policy and any other supporting documents that evidence compliance with the BMA Corporate Governance Policy July 2020 and the nine Principles contained therein ",null,null,null,null,null,null,null,null,"Select"]
[]
[7,"Copy of the applicant's risk management policy (including a risk appetite statement) together with a risk register/matrix that identifies key risks and details how risk items are tracked, mitigated, monitored and controlled ",null,null,null,null,null,null,null,null,"Select"]
[]
[8,"Copy of the applicant's compliance policy (including regulatory compliance) and any other supporting compliance related documents/procedures",null,null,null,null,null,null,null,null,"Select"]
{"$rows_left_out":31}
{"sheet":"VII-Declarations","index":6,"n_rows":30,"n_cols":19,"rows_kept":30,"cut":false,"hidden":false,"merged":[[26,1,26,4],[26,6,26,9],[26,11,26,15],[29,0,29,15],[18,1,18,4],[18,6,18,9],[18,11,18,15],[22,0,25,0],[22,1,25,4],[22,6,25,9],[22,11,25,15],[0,0,0,15],[8,1,8,11],[11,0,11,12],[14,0,17,0],[14,1,17,4],[14,6,17,9],[14,11,17,15],[7,1,7,11],[1,0,1,15],[3,0,3,6],[4,0,5,12],[6,1,6,11]]}
["Investment Business Test Licence Application Form"]
["DECLARATIONS"]
[]
[]
["I, (full name and address)"]
[]
[1,"Confirm that I have read and understand the provisions of the Investment Business Act 2003 (Act) and I declare that the business in respect of which this application is made will be conducted in accordance with the provisions of the Act, the Regulations, Rules and Codes of Conduct.",null,null,null,null,null,null,null,null,null,null,"Select",null,null,null,null,null,{"$f":"IF(OR(F7=0,F7=\"Select\"),0,1)","v":0}]
[2,"Declare that the particulars supplied in the application are true to the best of my knowledge and belief.",null,null,null,null,null,null,null,null,null,null,"Select",null,null,null,null,null,{"$f":"IF(OR(F8=0,F8=\"Select\"),0,1)","v":0}]
[3,"Confirm that the applicant shall notify the BMA immediately if the information provided changes in any material way either prior to or subsequent to licensing or registration, as applicable.",null,null,null,null,null,null,null,null,null,null,"Select",null,null,null,null,null,{"$f":"IF(OR(F9=0,F9=\"Select\"),0,1)","v":0}]
[]
[null,null,null,null,null,null,null,null,null,null,null,null,null,null,null,null,null,null,{"$f":"SUM(S7:S10)","v":0}]
["Note: The declaration should be signed electronically (see 'I-Instructions' tab for further details) by two directors, or one director and an officer of the applicant.",null,null,null,null,null,null,null,null,null,null,null,null,null,null,null,null,null,5]
[null,null,null,null,null,null,null,null,null,null,null,null,null,null,null,null,null,null,{"$f":"S11/S12","v":0}]
[]
[1]
[]
[]
[]
[null,"Name and e-mail address",null,null,null,null,"Position",null,null,null,null,"Date and signature"]
[]
{"$rows_left_out":10}